Compiling problem [Solved]

I currently have a problem compiling sponge. it seems that it because of the compiler being denied accuses to files at https://libraries.minecraft.net//forgeBin/1.8-11.14.1.1334/forgeBin-1.8-11.14.1.1334.pom

I’m partly baffled as my Travis-Cl build went through fine.
https://travis-ci.org/vlee489/Sponge

19:47:11.283 [DEBUG] [org.gradle.api.internal.artifacts.ivyservice.resolveengine
.graph.ResolvedConfigurationDependencyGraphVisitor                             ]
                                                                               A
ttaching com.jcraft:jsch:0.1.46(runtime) to its parents.
19:47:11.288 [DEBUG] [org.gradle.api.internal.artifacts.ivyservice.resolveengine
.graph.ResolvedConfigurationDependencyGraphVisitor                             ]
                                                                               A
ttaching com.googlecode.javaewah:JavaEWAH:0.5.6(runtime) to its parents.
19:47:11.294 [DEBUG] [org.gradle.api.internal.artifacts.ivyservice.resolveengine
.graph.ResolvedConfigurationDependencyGraphVisitor                             ]
                                                                               A
ttaching org.eclipse.equinox:app:1.3.200-v20130910-1609(compile) to its parents.

19:47:11.299 [DEBUG] [org.gradle.api.internal.artifacts.ivyservice.resolveengine
.graph.ResolvedConfigurationDependencyGraphVisitor                             ]
                                                                               A
ttaching org.eclipse.equinox:app:1.3.200-v20130910-1609(master) to its parents.
19:47:11.304 [DEBUG] [org.gradle.api.internal.artifacts.ivyservice.resolveengine
.graph.ResolvedConfigurationDependencyGraphVisitor                             ]
                                                                               A
ttaching org.eclipse.equinox:app:1.3.200-v20130910-1609(runtime) to its parents.

19:47:11.311 [DEBUG] [org.gradle.api.internal.artifacts.ivyservice.resolveengine
.graph.ResolvedConfigurationDependencyGraphVisitor                             ]
                                                                               A
ttaching com.googlecode.concurrentlinkedhashmap:concurrentlinkedhashmap-lru:1.4.
2(compile) to its parents.
19:47:11.317 [DEBUG] [org.gradle.api.internal.artifacts.ivyservice.resolveengine
.graph.ResolvedConfigurationDependencyGraphVisitor                             ]
                                                                               A
ttaching com.googlecode.concurrentlinkedhashmap:concurrentlinkedhashmap-lru:1.4.
2(master) to its parents.
19:47:11.322 [DEBUG] [org.gradle.api.internal.artifacts.ivyservice.resolveengine
.graph.ResolvedConfigurationDependencyGraphVisitor                             ]
                                                                               A
ttaching com.googlecode.concurrentlinkedhashmap:concurrentlinkedhashmap-lru:1.4.
2(runtime) to its parents.
19:47:11.328 [DEBUG] [org.gradle.api.internal.artifacts.ivyservice.resolveengine
.graph.ResolvedConfigurationDependencyGraphVisitor                             ]
                                                                               A
ttaching net.java.jutils:jutils:1.0.0(compile) to its parents.
19:47:11.334 [DEBUG] [org.gradle.api.internal.artifacts.ivyservice.resolveengine
.graph.ResolvedConfigurationDependencyGraphVisitor                             ]
                                                                               A
ttaching net.java.jutils:jutils:1.0.0(master) to its parents.
19:47:11.341 [DEBUG] [org.gradle.api.internal.artifacts.ivyservice.resolveengine
.graph.ResolvedConfigurationDependencyGraphVisitor                             ]
                                                                               A
ttaching net.java.jutils:jutils:1.0.0(runtime) to its parents.
19:47:11.349 [DEBUG] [org.gradle.api.internal.artifacts.ivyservice.resolveengine
.graph.ResolvedConfigurationDependencyGraphVisitor                             ]
                                                                               A
ttaching net.java.jinput:jinput-platform:2.0.5(compile) to its parents.
19:47:11.355 [DEBUG] [org.gradle.api.internal.artifacts.ivyservice.resolveengine
.graph.ResolvedConfigurationDependencyGraphVisitor                             ]
                                                                               A
ttaching net.java.jinput:jinput-platform:2.0.5(runtime) to its parents.
19:47:11.364 [DEBUG] [org.gradle.api.internal.artifacts.ivyservice.resolveengine
.graph.ResolvedConfigurationDependencyGraphVisitor                             ]
                                                                               A
ttaching net.java.jinput:jinput-platform:2.0.5(master) to its parents.
19:47:11.369 [DEBUG] [org.gradle.api.internal.artifacts.ivyservice.resolveengine
.graph.ResolvedConfigurationDependencyGraphVisitor                             ]
                                                                               A
ttaching org.eclipse.update:configurator:3.2.100-v20070615(compile) to its paren
ts.
19:47:11.379 [DEBUG] [org.gradle.api.internal.artifacts.ivyservice.resolveengine
.graph.ResolvedConfigurationDependencyGraphVisitor                             ]
                                                                               A
ttaching org.eclipse.update:configurator:3.2.100-v20070615(master) to its parent
s.
19:47:11.386 [DEBUG] [org.gradle.api.internal.artifacts.ivyservice.resolveengine
.graph.ResolvedConfigurationDependencyGraphVisitor                             ]
                                                                               A
ttaching org.eclipse.update:configurator:3.2.100-v20070615(runtime) to its paren
ts.
19:47:11.395 [DEBUG] [org.gradle.api.internal.artifacts.ivyservice.resolveengine
.graph.ResolvedConfigurationDependencyGraphVisitor                             ]
                                                                               A
ttaching org.slf4j:slf4j-api:1.7.7(compile) to its parents.
19:47:11.401 [DEBUG] [org.gradle.api.internal.artifacts.ivyservice.resolveengine
.graph.ResolvedConfigurationDependencyGraphVisitor                             ]
                                                                               A
ttaching org.slf4j:slf4j-api:1.7.7(master) to its parents.
19:47:11.410 [DEBUG] [org.gradle.api.internal.artifacts.ivyservice.resolveengine
.graph.ResolvedConfigurationDependencyGraphVisitor                             ]
                                                                               A
ttaching org.slf4j:slf4j-api:1.7.7(runtime) to its parents.
19:47:11.417 [DEBUG] [org.gradle.api.internal.artifacts.ivyservice.resolveengine
.graph.ResolvedConfigurationDependencyGraphVisitor                             ]
                                                                               A
ttaching com.google.guava:guava:18.0(compile) to its parents.
19:47:11.422 [DEBUG] [org.gradle.api.internal.artifacts.ivyservice.resolveengine
.graph.ResolvedConfigurationDependencyGraphVisitor                             ]
                                                                               A
ttaching com.google.guava:guava:18.0(master) to its parents.
19:47:11.427 [DEBUG] [org.gradle.api.internal.artifacts.ivyservice.resolveengine
.graph.ResolvedConfigurationDependencyGraphVisitor                             ]
                                                                               A
ttaching com.google.guava:guava:18.0(runtime) to its parents.
19:47:11.433 [DEBUG] [org.gradle.api.internal.artifacts.ivyservice.resolveengine
.graph.ResolvedConfigurationDependencyGraphVisitor                             ]
                                                                               A
ttaching com.google.guava:guava:18.0(default) to its parents.
19:47:11.438 [DEBUG] [org.gradle.api.internal.artifacts.ivyservice.resolveengine
.graph.ResolvedConfigurationDependencyGraphVisitor                             ]
                                                                               A
ttaching net.sf.jopt-simple:jopt-simple:4.6(compile) to its parents.
19:47:11.444 [DEBUG] [org.gradle.api.internal.artifacts.ivyservice.resolveengine
.graph.ResolvedConfigurationDependencyGraphVisitor                             ]
                                                                               A
ttaching net.sf.jopt-simple:jopt-simple:4.6(master) to its parents.
19:47:11.449 [DEBUG] [org.gradle.api.internal.artifacts.ivyservice.resolveengine
.graph.ResolvedConfigurationDependencyGraphVisitor                             ]
                                                                               A
ttaching net.sf.jopt-simple:jopt-simple:4.6(runtime) to its parents.
19:47:11.455 [DEBUG] [org.gradle.api.internal.artifacts.ivyservice.resolveengine
.graph.ResolvedConfigurationDependencyGraphVisitor                             ]
                                                                               A
ttaching org.eclipse.equinox:preferences:3.5.200-v20140224-1527(compile) to its
parents.
19:47:11.461 [DEBUG] [org.gradle.api.internal.artifacts.ivyservice.resolveengine
.graph.ResolvedConfigurationDependencyGraphVisitor                             ]
                                                                               A
ttaching org.eclipse.equinox:preferences:3.5.200-v20140224-1527(master) to its p
arents.
19:47:11.467 [DEBUG] [org.gradle.api.internal.artifacts.ivyservice.resolveengine
.graph.ResolvedConfigurationDependencyGraphVisitor                             ]
                                                                               A
ttaching org.eclipse.equinox:preferences:3.5.200-v20140224-1527(runtime) to its
parents.
19:47:11.472 [DEBUG] [org.gradle.api.internal.artifacts.ivyservice.resolveengine
.graph.ResolvedConfigurationDependencyGraphVisitor                             ]
                                                                               A
ttaching org.eclipse:osgi:3.10.0-v20140606-1445(compile) to its parents.
19:47:11.478 [DEBUG] [org.gradle.api.internal.artifacts.ivyservice.resolveengine
.graph.ResolvedConfigurationDependencyGraphVisitor                             ]
                                                                               A
ttaching org.eclipse:osgi:3.10.0-v20140606-1445(master) to its parents.
19:47:11.484 [DEBUG] [org.gradle.api.internal.artifacts.ivyservice.resolveengine
.graph.ResolvedConfigurationDependencyGraphVisitor                             ]
                                                                               A
ttaching org.eclipse:osgi:3.10.0-v20140606-1445(runtime) to its parents.
19:47:11.491 [DEBUG] [org.gradle.api.internal.artifacts.ivyservice.resolveengine
.graph.ResolvedConfigurationDependencyGraphVisitor                             ]
                                                                               A
ttaching org.eclipse.core:jobs:3.6.0-v20140424-0053(compile) to its parents.
19:47:11.499 [DEBUG] [org.gradle.api.internal.artifacts.ivyservice.resolveengine
.graph.ResolvedConfigurationDependencyGraphVisitor                             ]
                                                                               A
ttaching org.eclipse.core:jobs:3.6.0-v20140424-0053(master) to its parents.
19:47:11.508 [DEBUG] [org.gradle.api.internal.artifacts.ivyservice.resolveengine
.graph.ResolvedConfigurationDependencyGraphVisitor                             ]
                                                                               A
ttaching org.eclipse.core:jobs:3.6.0-v20140424-0053(runtime) to its parents.
19:47:11.517 [DEBUG] [org.gradle.api.internal.artifacts.ivyservice.resolveengine
.graph.ResolvedConfigurationDependencyGraphVisitor                             ]
                                                                               A
ttaching org.eclipse.core:contenttype:3.4.200-v20140207-1251(compile) to its par
ents.
19:47:11.524 [DEBUG] [org.gradle.api.internal.artifacts.ivyservice.resolveengine
.graph.ResolvedConfigurationDependencyGraphVisitor                             ]
                                                                               A
ttaching org.eclipse.core:contenttype:3.4.200-v20140207-1251(master) to its pare
nts.
19:47:11.532 [DEBUG] [org.gradle.api.internal.artifacts.ivyservice.resolveengine
.graph.ResolvedConfigurationDependencyGraphVisitor                             ]
                                                                               A
ttaching org.eclipse.core:contenttype:3.4.200-v20140207-1251(runtime) to its par
ents.
19:47:11.544 [DEBUG] [org.gradle.api.internal.artifacts.ivyservice.resolveengine
.graph.ResolvedConfigurationDependencyGraphVisitor                             ]
                                                                               A
ttaching org.eclipse.core:runtime:3.10.0-v20140318-2214(compile) to its parents.

19:47:11.553 [DEBUG] [org.gradle.api.internal.artifacts.ivyservice.resolveengine
.graph.ResolvedConfigurationDependencyGraphVisitor                             ]
                                                                               A
ttaching org.eclipse.core:runtime:3.10.0-v20140318-2214(master) to its parents.
19:47:11.564 [DEBUG] [org.gradle.api.internal.artifacts.ivyservice.resolveengine
.graph.ResolvedConfigurationDependencyGraphVisitor                             ]
                                                                               A
ttaching org.eclipse.core:runtime:3.10.0-v20140318-2214(runtime) to its parents.

19:47:11.574 [DEBUG] [org.gradle.api.internal.artifacts.ivyservice.resolveengine
.oldresult.TransientConfigurationResultsBuilder                                ]
                                                                               F
lushing resolved configuration data in Binary store in C:\Users\Vincent\AppData\
Local\Temp\gradle356949771941822153.bin. Wrote root org.spongepowered:Sponge:1.8
-1334-1.1DEV-0:runtime.
19:47:11.600 [ERROR] [org.gradle.BuildExceptionReporter]
19:47:11.607 [ERROR] [org.gradle.BuildExceptionReporter] FAILURE: Build failed w
ith an exception.
19:47:11.615 [ERROR] [org.gradle.BuildExceptionReporter]
19:47:11.620 [ERROR] [org.gradle.BuildExceptionReporter] * What went wrong:
19:47:11.626 [ERROR] [org.gradle.BuildExceptionReporter] Could not resolve all d
ependencies for configuration ':runtime'.
19:47:11.631 [ERROR] [org.gradle.BuildExceptionReporter] > Could not resolve :fo
rgeBin:1.8-11.14.1.1334.
19:47:11.635 [ERROR] [org.gradle.BuildExceptionReporter]   Required by:
19:47:11.638 [ERROR] [org.gradle.BuildExceptionReporter]       org.spongepowered
:Sponge:1.8-1334-1.1DEV-0
19:47:11.643 [ERROR] [org.gradle.BuildExceptionReporter]    > Could not GET 'htt
ps://libraries.minecraft.net//forgeBin/1.8-11.14.1.1334/forgeBin-1.8-11.14.1.133
4.pom'. Received status code 403 from server: Forbidden
19:47:11.650 [ERROR] [org.gradle.BuildExceptionReporter]
19:47:11.654 [ERROR] [org.gradle.BuildExceptionReporter] * Try:
19:47:11.660 [ERROR] [org.gradle.BuildExceptionReporter] Run with --stacktrace o
ption to get the stack trace.
19:47:11.666 [LIFECYCLE] [org.gradle.BuildResultLogger]
19:47:11.670 [LIFECYCLE] [org.gradle.BuildResultLogger] BUILD FAILED
19:47:11.675 [LIFECYCLE] [org.gradle.BuildResultLogger]
19:47:11.681 [LIFECYCLE] [org.gradle.BuildResultLogger] Total time: 1 mins 5.516
 secs
19:47:11.685 [DEBUG] [org.gradle.api.internal.tasks.compile.daemon.CompilerDaemo
nManager                                                                       ]
                                                                               S
topping 0 compiler daemon(s).
19:47:11.691 [INFO] [org.gradle.api.internal.tasks.compile.daemon.CompilerDaemon
Manager                                                                        ]
                                                                               S
topped 0 compiler daemon(s).
19:47:11.696 [DEBUG] [org.gradle.cache.internal.DefaultFileLockManager] Releasin
g lock on buildscript class cache for settings file 'C:\Users\Vincent\Documents\
GitHub\Sponge\settings.gradle' (C:\Users\Vincent\.gradle\caches\2.3\scripts\sett
ings_cwlc9nj6uylx5vj8esf5d354h\SettingsScript\buildscript).
19:47:11.699 [DEBUG] [org.gradle.cache.internal.DefaultFileLockManager] Releasin
g lock on no_buildscript class cache for settings file 'C:\Users\Vincent\Documen
ts\GitHub\Sponge\settings.gradle' (C:\Users\Vincent\.gradle\caches\2.3\scripts\s
ettings_cwlc9nj6uylx5vj8esf5d354h\SettingsScript\no_buildscript).
19:47:11.701 [DEBUG] [org.gradle.cache.internal.DefaultFileLockManager] Releasin
g lock on buildscript class cache for build file 'C:\Users\Vincent\Documents\Git
Hub\Sponge\build.gradle' (C:\Users\Vincent\.gradle\caches\2.3\scripts\build_eu4n
1u570jy637nax1qykazqi\ProjectScript\buildscript).
19:47:11.704 [DEBUG] [org.gradle.cache.internal.DefaultFileLockManager] Releasin
g lock on no_buildscript class cache for build file 'C:\Users\Vincent\Documents\
GitHub\Sponge\build.gradle' (C:\Users\Vincent\.gradle\caches\2.3\scripts\build_e
u4n1u570jy637nax1qykazqi\ProjectScript\no_buildscript).
19:47:11.708 [DEBUG] [org.gradle.cache.internal.DefaultFileLockManager] Releasin
g lock on buildscript class cache for build file 'C:\Users\Vincent\Documents\Git
Hub\Sponge\Mixin\build.gradle' (C:\Users\Vincent\.gradle\caches\2.3\scripts\buil
d_eol89qs3qgf9r6b5m3gyepp42\ProjectScript\buildscript).
19:47:11.711 [DEBUG] [org.gradle.cache.internal.DefaultFileLockManager] Releasin
g lock on no_buildscript class cache for build file 'C:\Users\Vincent\Documents\
GitHub\Sponge\Mixin\build.gradle' (C:\Users\Vincent\.gradle\caches\2.3\scripts\b
uild_eol89qs3qgf9r6b5m3gyepp42\ProjectScript\no_buildscript).
19:47:11.714 [DEBUG] [org.gradle.cache.internal.DefaultFileLockManager] Releasin
g lock on buildscript class cache for build file 'C:\Users\Vincent\Documents\Git
Hub\Sponge\SpongeAPI\build.gradle' (C:\Users\Vincent\.gradle\caches\2.3\scripts\
build_8ql6o237pqhff1ed6sjpmm49i\ProjectScript\buildscript).
19:47:11.716 [DEBUG] [org.gradle.cache.internal.DefaultFileLockManager] Releasin
g lock on no_buildscript class cache for build file 'C:\Users\Vincent\Documents\
GitHub\Sponge\SpongeAPI\build.gradle' (C:\Users\Vincent\.gradle\caches\2.3\scrip
ts\build_8ql6o237pqhff1ed6sjpmm49i\ProjectScript\no_buildscript).
19:47:11.719 [DEBUG] [org.gradle.cache.internal.btree.BTreePersistentIndexedCach
e                                                                              ]
                                                                               C
losing cache artifact-at-url.bin (C:\Users\Vincent\.gradle\caches\modules-2\meta
data-2.14\artifact-at-url.bin)
19:47:11.721 [DEBUG] [org.gradle.cache.internal.btree.BTreePersistentIndexedCach
e                                                                              ]
                                                                               C
losing cache artifact-at-repository.bin (C:\Users\Vincent\.gradle\caches\modules
-2\metadata-2.14\artifact-at-repository.bin)
19:47:11.724 [DEBUG] [org.gradle.cache.internal.btree.BTreePersistentIndexedCach
e                                                                              ]
                                                                               C
losing cache module-metadata.bin (C:\Users\Vincent\.gradle\caches\modules-2\meta
data-2.14\module-metadata.bin)
19:47:11.727 [DEBUG] [org.gradle.cache.internal.btree.BTreePersistentIndexedCach
e                                                                              ]
                                                                               C
losing cache module-versions.bin (C:\Users\Vincent\.gradle\caches\modules-2\meta
data-2.14\module-versions.bin)
19:47:11.732 [DEBUG] [org.gradle.cache.internal.DefaultFileLockManager] Releasin
g lock on artifact cache (C:\Users\Vincent\.gradle\caches\modules-2).
19:47:11.749 [DEBUG] [org.gradle.cache.internal.DefaultCacheAccess] Cache Plugin
 Resolution Cache (C:\Users\Vincent\.gradle\caches\2.3\plugin-resolution) was cl
osed 0 times.
19:47:11.773 [DEBUG] [org.gradle.api.internal.artifacts.ivyservice.resolveengine
.store.CachedStoreFactory                                                      ]
                                                                               R
esolution result cache closed. Cache reads: 0, disk reads: 0 (avg: 0.0 secs, tot
al: 0.0 secs)
19:47:11.779 [DEBUG] [org.gradle.api.internal.artifacts.ivyservice.resolveengine
.store.CachedStoreFactory                                                      ]
                                                                               R
esolved configuration cache closed. Cache reads: 0, disk reads: 0 (avg: 0.0 secs
, total: 0.0 secs)
19:47:11.782 [DEBUG] [org.gradle.api.internal.artifacts.ivyservice.resolveengine
.store.ResolutionResultsStoreFactory                                           ]
                                                                               D
eleted 2 resolution results binary files in 0.011 secs
19:47:11.785 [DEBUG] [org.gradle.api.internal.artifacts.ivyservice.ivyresolve.me
mcache.InMemoryCachedRepositoryFactory                                         ]
                                                                               I
n-memory dependency metadata cache closed. Repos cached: 13, cache instances: 8,
 modules served from cache: 115, artifacts: 28

C:\Users\Vincent\Documents\GitHub\Sponge>

See

And

You need to setup the workspace, gradlew setup[Decomp|Dev|CI]Workspace

Thanks solved it now.